Merge branch 'allow-fail-on-dev' into 'master'

Allow failure on private development deployments

See merge request !275
25 jobs for master in 65 minutes and 39 seconds (queued for 4 seconds)
Status Name Job ID Coverage
  Build
passed compile-and-unit-test #653158
osdu-medium

00:05:32

88.0%
passed osdu-gcp-helm-charts #653159
osdu-small

00:00:16

passed verify_existing_requirements #653160
osdu-medium

00:01:56

 
  Containerize
passed aws-containerize #653163
osdu-medium

00:02:29

passed azure_containerize #653162
osdu-medium

00:02:35

passed containerize #653164
osdu-medium

00:02:12

passed osdu-gcp-containerize-gitlab #653161
osdu-medium

00:01:58

 
  Scan
passed bandit-sast #653167
osdu-medium

00:00:35

failed eslint-sast #653168
osdu-medium allowed to fail

00:01:44

passed fossa-analyze #653165
osdu-medium

00:03:14

failed gemnasium-python-dependency_scanning #653166
osdu-medium allowed to fail

00:02:16

passed license_scanning #653170
osdu-medium

00:02:13

passed semgrep-sast #653169
osdu-medium

00:00:53

 
  Deploy
passed aws-update-eks #653176
osdu-medium

00:01:25

passed azure_deploy #653175
osdu-medium

00:01:53

passed ibm-deploy #653173
osdu-medium

00:05:07

failed ibm-deploy-devpri #653174
osdu-medium allowed to fail

01:00:01

passed osdu-gcp-deploy-configmap #653171

00:00:18

passed osdu-gcp-deploy-deployment #653172

00:01:05

 
  Integration
passed aws-test-python #653180
osdu-medium

00:02:27

failed azure_test_py #653179
allowed to fail

00:07:40

passed ibm-test #653178

00:11:33

passed osdu-gcp-test-python #653177

00:06:35

 
  Attribution
passed fossa-check-notice #653181
osdu-small

00:00:17

 
  Publish
passed ibm-preship-promote #653182
osdu-medium

00:00:27

 
Name Stage Failure
failed
ibm-deploy-devpri Deploy The script exceeded the maximum execution time set for the job
Using project "og-cicd".
$ oc project $IBM_OPENSHIFT_DEVPRI_PROJECT
Already on project "og-cicd" on server "https://c103-e.us-south.containers.cloud.ibm.com:31778".
$ oc get bc/$CI_PROJECT_NAME 2> /dev/null || oc new-build --name $CI_PROJECT_NAME --binary --strategy source --image-stream openshift/python:3.8-ubi8
NAME TYPE FROM LATEST
wellbore-domain-services Source Binary 50
$ oc start-build $CI_PROJECT_NAME --from-dir=. --follow
Uploading directory "." as binary input for the build ...
.......................................................................................................................................................................................................................................................................................................................................................................................................................................................................................................................................................................................................................................................................................................................................
ERROR: Job failed: execution took longer than 1h0m0s seconds
failed
azure_test_py Integration
../../venv/lib/python3.8/site-packages/requests/adapters.py:504: ConnectTimeout
------------------------------ Captured log call -------------------------------
14:41:47 [INFO] - test_crud_record_versions[osdu_welllog] => GET https://osdu-glab.msft-osdu-test.org/api/os-wellbore-ddms/ddms/v3/welllogs/opendes:work-product-component--WellLog:c7c421a7-f496-5aef-8093-298c32bfdea9/versions
=========================== short test summary info ============================
FAILED functional/tests/test_chunking.py::test_send_one_chunk_without_session[serializer0-wellbore_trajectory]
FAILED functional/tests/test_chunking.py::test_multiple_overwrite_sessions_in_parallel_then_commit[serializer1-wellbore_trajectory]
FAILED functional/tests/test_crud_v3.py::test_crud_record_versions[osdu_welllog]
============ 3 failed, 156 passed, 38 skipped in 330.98s (0:05:30) =============
ERROR: Job failed: exit code 1
failed
gemnasium-python-dependency_scanning Scan
Running after_script
Running after script...
$ tar -cC ~/.m2 repository | tar -xC $CI_PROJECT_DIR/.m2
Uploading artifacts for failed job
Uploading artifacts...
WARNING: gl-dependency-scanning-report.json: no matching files
ERROR: No files to upload
Cleaning up file based variables
ERROR: Job failed: exit code 1
failed
eslint-sast Scan
Running after script...
$ tar -cC ~/.m2 repository | tar -xC $CI_PROJECT_DIR/.m2
tar: can't remove old file repository/sslext/sslext/1.2-0/sslext-1.2-0.pom.sha1: Permission denied
Uploading artifacts for failed job
Uploading artifacts...
WARNING: gl-sast-report.json: no matching files
ERROR: No files to upload
Cleaning up file based variables
ERROR: Job failed: exit code 1