add trace and code cleaup

25 jobs for trusted-optimize_describe in 26 minutes and 43 seconds (queued for 5 seconds)
Status Name Job ID Coverage
  Review
passed trusted-merge-branch-verification #648563
osdu-small

00:00:23

 
  Build
passed compile-and-unit-test #648564
osdu-medium

00:05:40

88.0%
passed osdu-gcp-helm-charts #648565
osdu-small

00:00:30

passed verify_existing_requirements #648566
osdu-medium

00:01:38

 
  Containerize
passed aws-containerize #648569
osdu-medium

00:02:57

passed azure_containerize #648568
osdu-medium

00:02:44

passed containerize #648570
osdu-medium

00:02:56

passed osdu-gcp-containerize-gitlab #648567
osdu-medium

00:02:14

 
  Scan
passed bandit-sast #648573
osdu-medium

00:00:40

failed eslint-sast #648574
osdu-medium allowed to fail

00:01:32

passed fossa-analyze #648571
osdu-medium

00:12:19

failed gemnasium-python-dependency_scanning #648572
osdu-medium allowed to fail

00:00:50

passed license_scanning #648576
osdu-medium

00:02:40

passed semgrep-sast #648575
osdu-medium

00:00:38

 
  Deploy
passed aws-update-eks #648581
osdu-medium

00:03:17

passed azure_deploy #648580
osdu-medium

00:02:13

failed ibm-deploy #649930
osdu-medium

00:05:56

passed osdu-gcp-deploy-configmap #648577

00:00:19

passed osdu-gcp-deploy-deployment #648578

00:00:58

failed ibm-deploy #648579
osdu-medium

00:14:38

 
  Integration
passed aws-test-python #648585
osdu-medium

00:01:54

failed azure_test_py #648584
allowed to fail

00:05:26

skipped ibm-test #648583
passed osdu-gcp-test-python #648582

00:07:16

 
  Attribution
passed fossa-check-notice #648586
osdu-small

00:02:19

 
Name Stage Failure
failed
ibm-deploy Deploy
NAME                       TYPE     FROM         LATEST
wellbore-domain-services Source Git@master 4
$ oc start-build $CI_PROJECT_NAME --from-dir=. --follow
Uploading directory "." as binary input for the build ...
............................................................
Uploading finished
Error from server (BadRequest): unable to wait for build wellbore-domain-services-5 to run: timed out waiting for the condition
Cleaning up file based variables
ERROR: Job failed: exit code 1
failed
azure_test_py Integration
FAILED functional/tests/test_chunking.py::test_multiple_update_sessions_in_parallel_then_commit[serializer1-log]
FAILED functional/tests/test_chunking.py::test_get_data_from_record_data_without_dask[serializer0-log]
FAILED functional/tests/test_chunking.py::test_data_without_dask_update_session[serializer0-log]
FAILED functional/tests/test_crud.py::test_crud_create_record[data_partition-logset]
FAILED functional/tests/test_crud.py::test_crud_get_record[data_partition-logset]
FAILED functional/tests/test_crud.py::test_crud_record_versions[data_partition-logset]
FAILED functional/tests/test_crud.py::test_crud_delete_record[data_partition-logset]
============ 20 failed, 139 passed, 38 skipped in 192.84s (0:03:12) ============
ERROR: Job failed: exit code 1
failed
eslint-sast Scan
Running after script...
$ tar -cC ~/.m2 repository | tar -xC $CI_PROJECT_DIR/.m2
tar: can't remove old file repository/sslext/sslext/1.2-0/sslext-1.2-0.pom.sha1: Permission denied
Uploading artifacts for failed job
Uploading artifacts...
WARNING: gl-sast-report.json: no matching files
ERROR: No files to upload
Cleaning up file based variables
ERROR: Job failed: exit code 1
failed
gemnasium-python-dependency_scanning Scan
Running after_script
Running after script...
$ tar -cC ~/.m2 repository | tar -xC $CI_PROJECT_DIR/.m2
Uploading artifacts for failed job
Uploading artifacts...
WARNING: gl-dependency-scanning-report.json: no matching files
ERROR: No files to upload
Cleaning up file based variables
ERROR: Job failed: exit code 1