unpin s3fs in requirements.in to allow dependencies upgrade

26 jobs for trusted-avincent/update_s3fs in 67 minutes and 25 seconds (queued for 3 seconds)
Status Name Job ID Coverage
  Review
passed trusted-merge-branch-verification #639370
osdu-small

00:00:24

 
  Build
passed compile-and-unit-test #639371
osdu-medium

00:05:19

88.0%
failed generate_updated_requirements #639969
osdu-medium allowed to fail

00:01:38

passed osdu-gcp-helm-charts #639372
osdu-small

00:00:36

passed verify_existing_requirements #639373
osdu-medium

00:01:55

failed generate_updated_requirements #639374
osdu-medium allowed to fail

00:01:44

 
  Containerize
passed aws-containerize #639377
osdu-medium

00:02:59

passed azure_containerize #639376
osdu-medium

00:02:37

passed containerize #639378
osdu-medium

00:00:46

passed osdu-gcp-containerize-gitlab #639375
osdu-medium

00:01:57

 
  Scan
passed bandit-sast #639381
osdu-medium

00:00:52

failed eslint-sast #639382
osdu-medium allowed to fail

00:01:39

passed fossa-analyze #639379
osdu-medium

00:01:32

failed gemnasium-python-dependency_scanning #639380
osdu-medium allowed to fail

00:00:53

passed license_scanning #639384
osdu-medium

00:02:28

passed semgrep-sast #639383
osdu-medium

00:00:47

 
  Deploy
passed aws-update-eks #639389
osdu-medium

00:00:52

passed azure_deploy #639388
osdu-medium

00:01:49

failed ibm-deploy #639387
osdu-medium

01:00:01

passed osdu-gcp-deploy-configmap #639385

00:00:34

passed osdu-gcp-deploy-deployment #639386

00:00:59

 
  Integration
passed aws-test-python #639393
osdu-medium

00:02:26

failed azure_test_py #639392
allowed to fail

00:06:01

skipped ibm-test #639391
passed osdu-gcp-test-python #639390

00:02:17

 
  Attribution
failed fossa-check-notice #639394
osdu-small

00:00:46

 
Name Stage Failure
failed
generate_updated_requirements Build
  httpx (from -r requirements_dev.in (line 10))
httpx==0.18.2 (from -c requirements.txt (line 183))
httpx==0.19.* (from pytest-httpx==0.13.0->-r requirements_dev.in (line 9))
Uploading artifacts for failed job
Uploading artifacts...
*.upg: found 1 matching files and directories

Uploading artifacts as "archive" to coordinator... ok
id=639969 responseStatus=201 Created token=1sz9wvyi
Cleaning up file based variables
ERROR: Job failed: exit code 1
failed
ibm-deploy Deploy The script exceeded the maximum execution time set for the job
In IBM deploy
$ oc project $IBM_OPENSHIFT_PROJECT
Already on project "og-cicd" on server "https://c103-e.us-south.containers.cloud.ibm.com:31805".
$ oc get bc/$CI_PROJECT_NAME 2> /dev/null || oc new-build --name $CI_PROJECT_NAME --binary --strategy source --image-stream openshift/python:3.8-ubi8
NAME TYPE FROM LATEST
wellbore-domain-services Source Binary 618
$ oc start-build $CI_PROJECT_NAME --from-dir=. --follow
Uploading directory "." as binary input for the build ...
........................................................................................................................................................................................................................................................................................................................................................................................................................................................................................................................................................................................................................................................................................................................................
ERROR: Job failed: execution took longer than 1h0m0s seconds
failed
azure_test_py Integration
FAILED functional/tests/test_chunking.py::test_get_data_with_column_filter - ...
FAILED functional/tests/test_chunking.py::test_get_data_with_limit_filter - A...
FAILED functional/tests/test_chunking.py::test_get_data_with_limit_and_offset_filter[well_log]
FAILED functional/tests/test_chunking.py::test_get_data_with_limit_and_offset_filter[wellbore_trajectory]
FAILED functional/tests/test_chunking.py::test_get_data_with_limit_and_offset_filter[log]
FAILED functional/tests/test_chunking.py::test_multiple_overwrite_sessions_in_parallel_then_commit[serializer0-well_log]
FAILED functional/tests/test_chunking.py::test_multiple_overwrite_sessions_in_parallel_then_commit[serializer0-wellbore_trajectory]
============ 15 failed, 144 passed, 38 skipped in 224.02s (0:03:44) ============
ERROR: Job failed: exit code 1
failed
fossa-check-notice Attribution
You can download the NOTICE file from this job's artifacts and directly commit it to the repository to resolve
this. Before doing so, review the differences to make sure that they make sense given the changes that you have
made. If they do not, reach out to a maintainer to help diagnose the issue.
Uploading artifacts for failed job
Uploading artifacts...
public: found 2 matching files and directories

Uploading artifacts as "archive" to coordinator... ok
id=639394 responseStatus=201 Created token=7d6cvsdu
Cleaning up file based variables
ERROR: Job failed: exit code 1
failed
eslint-sast Scan
Running after script...
$ tar -cC ~/.m2 repository | tar -xC $CI_PROJECT_DIR/.m2
tar: can't remove old file repository/sslext/sslext/1.2-0/sslext-1.2-0.pom.sha1: Permission denied
Uploading artifacts for failed job
Uploading artifacts...
WARNING: gl-sast-report.json: no matching files
ERROR: No files to upload
Cleaning up file based variables
ERROR: Job failed: exit code 1
failed
gemnasium-python-dependency_scanning Scan
Running after_script
Running after script...
$ tar -cC ~/.m2 repository | tar -xC $CI_PROJECT_DIR/.m2
Uploading artifacts for failed job
Uploading artifacts...
WARNING: gl-dependency-scanning-report.json: no matching files
ERROR: No files to upload
Cleaning up file based variables
ERROR: Job failed: exit code 1