Creating Release Commit

19 jobs for v0.11.0 in 15 minutes and 29 seconds (queued for 4 seconds)
latest
Status Name Job ID Coverage
  Build
passed compile-and-unit-test #558810
osdu-medium

00:04:05

88.0%
passed osdu-gcp-helm-charts #558811
osdu-small

00:00:21

 
  Containerize
passed aws-containerize #558814
osdu-medium

00:02:18

passed azure_containerize #558813
osdu-medium

00:02:27

passed containerize #558815
osdu-medium

00:01:58

passed osdu-gcp-containerize-for-release #558816
osdu-medium

00:01:55

passed osdu-gcp-containerize-gitlab #558812
osdu-medium

00:01:46

 
  Scan
passed fossa-analyze #558817
osdu-medium

00:01:36

 
  Deploy
passed aws-update-eks #558822
osdu-medium

00:01:24

passed azure_deploy #558821
osdu-medium

00:02:00

passed ibm-deploy #558820
osdu-medium

00:04:39

passed osdu-gcp-deploy-configmap #558818

00:00:23

passed osdu-gcp-deploy-deployment #558819

00:01:02

 
  Integration
passed aws-test-python #558826
osdu-medium

00:01:52

passed azure_test_py #558825

00:06:22

failed ibm-test #558824
allowed to fail

00:04:57

passed osdu-gcp-test-python #558823

00:02:41

 
  Attribution
failed fossa-check-notice #559005
osdu-small

00:00:20

failed fossa-check-notice #558827
osdu-small

00:00:19

 
Name Stage Failure
failed
fossa-check-notice Attribution
You can download the NOTICE file from this job's artifacts and directly commit it to the repository to resolve
this. Before doing so, review the differences to make sure that they make sense given the changes that you have
made. If they do not, reach out to a maintainer to help diagnose the issue.
Uploading artifacts for failed job
Uploading artifacts...
public: found 2 matching files and directories

Uploading artifacts as "archive" to coordinator... ok
id=559005 responseStatus=201 Created token=zSKNfG77
Cleaning up file based variables
ERROR: Job failed: exit code 1
failed
ibm-test Integration
FAILED functional/tests/test_chunking.py::test_multiple_update_sessions_in_parallel_then_commit[serializer1-well_log]
FAILED functional/tests/test_chunking.py::test_multiple_update_sessions_in_parallel_then_commit[serializer1-wellbore_trajectory]
FAILED functional/tests/test_chunking.py::test_multiple_update_sessions_in_parallel_then_commit[serializer1-log]
FAILED functional/tests/test_chunking.py::test_get_data_from_record_data_without_dask[serializer0-log]
FAILED functional/tests/test_chunking.py::test_data_without_dask_update_session[serializer0-log]
FAILED functional/tests/test_session.py::test_create_get_session - requests.e...
FAILED functional/tests/test_session.py::test_list_session - requests.excepti...
============ 35 failed, 124 passed, 38 skipped in 158.57s (0:02:38) ============
ERROR: Job failed: exit code 1