Fix validation error model

25 jobs for trusted-fserin/BUG_422_response_does_not_follow_schema in 19 minutes and 32 seconds (queued for 4 seconds)
Name Stage Failure
failed
fossa-check-notice Attribution
You can download the NOTICE file from this job's artifacts and directly commit it to the repository to resolve
this. Before doing so, review the differences to make sure that they make sense given the changes that you have
made. If they do not, reach out to a maintainer to help diagnose the issue.
Uploading artifacts for failed job
Uploading artifacts...
public: found 2 matching files and directories

Uploading artifacts as "archive" to coordinator... ok
id=547980 responseStatus=201 Created token=AMpQ-64j
Cleaning up file based variables
ERROR: Job failed: exit code 1
failed
ibm-test Integration
FAILED functional/tests/test_chunking.py::test_multiple_update_sessions_in_parallel_then_commit[serializer1-well_log]
FAILED functional/tests/test_chunking.py::test_multiple_update_sessions_in_parallel_then_commit[serializer1-wellbore_trajectory]
FAILED functional/tests/test_chunking.py::test_multiple_update_sessions_in_parallel_then_commit[serializer1-log]
FAILED functional/tests/test_chunking.py::test_get_data_from_record_data_without_dask[serializer0-log]
FAILED functional/tests/test_chunking.py::test_data_without_dask_update_session[serializer0-log]
FAILED functional/tests/test_session.py::test_create_get_session - requests.e...
FAILED functional/tests/test_session.py::test_list_session - requests.excepti...
============ 35 failed, 124 passed, 38 skipped in 169.04s (0:02:49) ============
ERROR: Job failed: exit code 1
failed
azure_test_py Integration
09:12:25 [INFO] - test_multiple_overwrite_sessions_in_parallel_then_commit[serializer1-wellbore_trajectory] =>  GET https://osdu-glab.msft-osdu-test.org/api/os-wellbore-ddms/alpha/ddms/v3/wellboretrajectories/opendes:work-product-component--WellboreTrajectory:0a017cf9c96348f7b75be5d22552787e/data
09:12:26 [INFO] - test_multiple_overwrite_sessions_in_parallel_then_commit[serializer1-wellbore_trajectory] <= status_code=200 (333 ms)
09:12:26 [INFO] - test_multiple_overwrite_sessions_in_parallel_then_commit[serializer1-wellbore_trajectory] => PATCH https://osdu-glab.msft-osdu-test.org/api/os-wellbore-ddms/alpha/ddms/v3/wellboretrajectories/opendes:work-product-component--WellboreTrajectory:0a017cf9c96348f7b75be5d22552787e/sessions/04f10aed-b795-44d0-9e13-9ad9bf63208a
09:12:27 [INFO] - test_multiple_overwrite_sessions_in_parallel_then_commit[serializer1-wellbore_trajectory] <= status_code=200 (986 ms)
09:12:27 [INFO] - test_multiple_overwrite_sessions_in_parallel_then_commit[serializer1-wellbore_trajectory] => GET https://osdu-glab.msft-osdu-test.org/api/os-wellbore-ddms/alpha/ddms/v3/wellboretrajectories/opendes:work-product-component--WellboreTrajectory:0a017cf9c96348f7b75be5d22552787e/data
=========================== short test summary info ============================
FAILED functional/tests/test_chunking.py::test_multiple_overwrite_sessions_in_parallel_then_commit[serializer1-wellbore_trajectory]
============ 1 failed, 158 passed, 38 skipped in 276.97s (0:04:36) =============
ERROR: Job failed: exit code 1
failed
eslint-sast Scan
Running after script...
$ tar -cC ~/.m2 repository | tar -xC $CI_PROJECT_DIR/.m2
tar: can't remove old file repository/sslext/sslext/1.2-0/sslext-1.2-0.pom.sha1: Permission denied
Uploading artifacts for failed job
Uploading artifacts...
WARNING: gl-sast-report.json: no matching files
ERROR: No files to upload
Cleaning up file based variables
ERROR: Job failed: exit code 1
failed
gemnasium-python-dependency_scanning Scan
Running after_script
Running after script...
$ tar -cC ~/.m2 repository | tar -xC $CI_PROJECT_DIR/.m2
Uploading artifacts for failed job
Uploading artifacts...
WARNING: gl-dependency-scanning-report.json: no matching files
ERROR: No files to upload
Cleaning up file based variables
ERROR: Job failed: exit code 1