set eks as deploy target

22 jobs for aws-eks in 70 minutes and 48 seconds (queued for 6 seconds)
Status Name Job ID Coverage
  Build
passed compile-and-unit-test #534348
osdu-medium

00:06:06

88.0%
passed osdu-gcp-helm-charts #534349
osdu-small

00:02:26

 
  Containerize
passed aws-containerize #534352
osdu-medium

00:02:42

passed azure_containerize #534351
osdu-medium

00:03:59

passed containerize #534353
osdu-medium

00:03:14

passed osdu-gcp-containerize-gitlab #534350
osdu-medium

00:03:28

 
  Scan
passed bandit-sast #534356
osdu-medium

00:01:54

failed eslint-sast #534357
osdu-medium allowed to fail

00:02:41

passed fossa-analyze #534354
osdu-medium

00:03:17

failed gemnasium-python-dependency_scanning #534355
osdu-medium allowed to fail

00:02:13

passed license_scanning #534359
osdu-medium

00:03:26

passed semgrep-sast #534358
osdu-medium

00:02:18

 
  Deploy
passed aws-update-eks #534364
osdu-medium

00:03:02

passed azure_deploy #534363
osdu-medium

00:03:31

failed ibm-deploy #534362
osdu-medium allowed to fail

01:00:01

passed osdu-gcp-deploy-configmap #534360

00:00:22

passed osdu-gcp-deploy-deployment #534361

00:00:53

 
  Integration
passed aws-test-python #534367
osdu-medium

00:04:09

passed azure_test_py #534366

00:05:54

failed ibm-test #534365
allowed to fail

00:04:38

passed osdu-gcp-test-python #534368

00:02:03

 
  Attribution
passed fossa-check-notice #534369
osdu-small

00:02:32

 
Name Stage Failure
failed
ibm-test Integration
FAILED functional/tests/test_crud.py::test_crud_delete_record[data_partition-wellbore]
FAILED functional/tests/test_crud.py::test_crud_delete_record[data_partition-logset]
FAILED functional/tests/test_crud.py::test_crud_delete_record[data_partition-marker]
FAILED functional/tests/test_crud.py::test_crud_delete_record[data_partition-trajectory]
FAILED functional/tests/test_crud.py::test_crud_delete_record[data_partition-log]
FAILED functional/tests/test_session.py::test_create_get_session - requests.e...
FAILED functional/tests/test_session.py::test_list_session - requests.excepti...
============ 59 failed, 100 passed, 37 skipped in 153.10s (0:02:33) ============
ERROR: Job failed: exit code 1
failed
ibm-deploy Deploy The script exceeded the maximum execution time set for the job
Collecting yarl==1.6.3
Downloading https://files.pythonhosted.org/packages/28/48/fdce6d8323b58799541eddfb37123d6d18ad762899ca64b82ed767ae2bf8/yarl-1.6.3-cp38-cp38-manylinux2014_x86_64.whl (324kB)
Collecting zict==2.0.0
Downloading https://files.pythonhosted.org/packages/5a/65/0f743c740c30cace984ef8ff96fd1e991083fa884900a8aad3efff3252b9/zict-2.0.0-py3-none-any.whl
Requirement already satisfied: setuptools in /opt/app-root/lib/python3.8/site-packages (from distributed==2021.07.2->-r requirements.txt (line 121)) (41.6.0)
Installing collected packages: six, python-dateutil, certifi, idna, charset-normalizer, urllib3, requests, pycparser, cffi, cryptography, pyjwt, adal, chardet, async-timeout, multidict, yarl, typing-extensions, attrs, aiohttp, azure-core, azure-datalake-store, msal, portalocker, msal-extensions, azure-identity, isodate, oauthlib, requests-oauthlib, msrest, azure-storage-blob, fsspec, adlfs, hiredis, aioredis, sniffio, anyio, asgiref, azure-common, azure-keyvault-certificates, azure-keyvault-keys, azure-keyvault-secrets, azure-keyvault, backoff, jmespath, botocore, s3transfer, boto3, cachetools, click, cloudpickle, colorama, toolz, pyyaml, pyparsing, packaging, locket, partd, msgpack, tornado, heapdict, zict, tblib, sortedcontainers, psutil, distributed, dask, decorator, starlette, pydantic, fastapi, pyasn1, rsa, pyasn1-modules, google-auth, google-auth-oauthlib, gcsfs, pytz, protobuf, googleapis-common-protos, grpcio, google-api-core, google-cloud-core, google-cloud-monitoring, google-cloud-trace, h11, httpcore, rfc3986, httpx, jsonbender, ply, jsonpath-ng, natsort, numpy, opencensus-context, opencensus, opencensus-ext-azure, opencensus-ext-logging, opencensus-proto, opencensus-ext-ocagent, opencensus-ext-stackdriver, osdu-core-lib-python, osdu-core-lib-python-aws, osdu-core-lib-python-azure, osdu-core-lib-python-gcp, osdu-core-lib-python-ibm, osdu-data-ecosystem-search, osdu-data-ecosystem-storage, xmltodict, osdu-log-recognition-lib, pandas, pyarrow, python-multipart, python-rapidjson, python-ulid, structlog, uvicorn
Running setup.py install for adlfs: started
Running setup.py install for adlfs: finished with status 'done'
ERROR: Job failed: execution took longer than 1h0m0s seconds
failed
eslint-sast Scan
Running after script...
$ tar -cC ~/.m2 repository | tar -xC $CI_PROJECT_DIR/.m2
tar: can't remove old file repository/sslext/sslext/1.2-0/sslext-1.2-0.pom.sha1: Permission denied
Uploading artifacts for failed job
Uploading artifacts...
WARNING: gl-sast-report.json: no matching files
ERROR: No files to upload
Cleaning up file based variables
ERROR: Job failed: exit code 1
failed
gemnasium-python-dependency_scanning Scan
Running after_script
Running after script...
$ tar -cC ~/.m2 repository | tar -xC $CI_PROJECT_DIR/.m2
Uploading artifacts for failed job
Uploading artifacts...
WARNING: gl-dependency-scanning-report.json: no matching files
ERROR: No files to upload
Cleaning up file based variables
ERROR: Job failed: exit code 1