fix gcp release containerize job

21 jobs for trusted-fix-ci in 15 minutes and 17 seconds (queued for 3 seconds)
latest
Status Name Job ID Coverage
  Review
passed trusted-merge-branch-verification #527127
osdu-small

00:00:25

 
  Build
passed compile-and-unit-test #527128
osdu-medium

00:04:22

89.0%
 
  Containerize
passed aws-containerize #527130
osdu-medium

00:01:54

passed azure_containerize #527129
osdu-medium

00:02:29

passed containerize #527131
osdu-medium

00:01:46

passed osdu-gcp-containerize #527132
osdu-medium

00:02:04

 
  Scan
passed bandit-sast #527135
osdu-medium

00:00:46

failed eslint-sast #527136
osdu-medium allowed to fail

00:02:08

passed fossa-analyze #527133
osdu-medium

00:01:41

failed gemnasium-python-dependency_scanning #527134
osdu-medium allowed to fail

00:00:42

passed license_scanning #527138
osdu-medium

00:03:10

passed semgrep-sast #527137
osdu-medium

00:00:54

 
  Deploy
passed aws-update-ecs #527142
osdu-medium

00:00:55

passed azure_deploy #527141
osdu-medium

00:01:54

failed ibm-deploy #527140
osdu-medium allowed to fail

00:05:33

passed osdu-gcp-deploy #527139

00:00:33

 
  Integration
passed aws-test-python #527145
osdu-medium

00:02:40

passed azure_test_py #527144

00:05:56

failed ibm-test #527143
allowed to fail

00:04:38

failed osdu-gcp-test-python #527146

00:02:40

 
  Attribution
passed fossa-check-notice #527147
osdu-small

00:00:19

 
Name Stage Failure
failed
ibm-test Integration
FAILED functional/tests/test_chunking.py::test_multiple_update_sessions_in_parallel_then_commit[serializer1-well_log]
FAILED functional/tests/test_chunking.py::test_multiple_update_sessions_in_parallel_then_commit[serializer1-wellbore_trajectory]
FAILED functional/tests/test_chunking.py::test_multiple_update_sessions_in_parallel_then_commit[serializer1-log]
FAILED functional/tests/test_chunking.py::test_get_data_from_record_data_without_dask[serializer0-log]
FAILED functional/tests/test_chunking.py::test_data_without_dask_update_session[serializer0-log]
FAILED functional/tests/test_session.py::test_create_get_session - requests.e...
FAILED functional/tests/test_session.py::test_list_session - requests.excepti...
============ 35 failed, 124 passed, 35 skipped in 160.76s (0:02:40) ============
ERROR: Job failed: exit code 1
failed
ibm-deploy Deploy
NAME                       TYPE     FROM     LATEST
wellbore-domain-services Source Binary 410
$ oc start-build $CI_PROJECT_NAME --from-dir=. --follow
Uploading directory "." as binary input for the build ...
............................................................
Uploading finished
Error from server (BadRequest): unable to wait for build wellbore-domain-services-411 to run: timed out waiting for the condition
Cleaning up file based variables
ERROR: Job failed: exit code 1
failed
osdu-gcp-test-python Integration
FAILED functional/tests/test_dips.py::test_create_dipset_for_dips_simple[data_partition-item_value_nan]
FAILED functional/tests/test_dips.py::test_create_dipset_for_dips_simple[authority_slb-missing_items]
FAILED functional/tests/test_dips.py::test_create_dipset_for_dips_simple[authority_slb-item_value_zero]
FAILED functional/tests/test_dips.py::test_create_dipset_for_dips_simple[authority_slb-item_value_nan]
ERROR functional/tests/test_log_data.py::test_add_log_bulk_data - requests.ex...
ERROR functional/tests/test_model_validation.py::test_record_should_keep_extra_field
ERROR functional/tests/test_traj_data.py::test_add_traj_bulk_data - requests....
============= 25 failed, 7 passed, 159 skipped, 3 errors in 3.96s ==============
ERROR: Job failed: exit code 1
failed
eslint-sast Scan
Running after script...
$ tar -cC ~/.m2 repository | tar -xC $CI_PROJECT_DIR/.m2
tar: can't remove old file repository/sslext/sslext/1.2-0/sslext-1.2-0.pom.sha1: Permission denied
Uploading artifacts for failed job
Uploading artifacts...
WARNING: gl-sast-report.json: no matching files
ERROR: No files to upload
Cleaning up file based variables
ERROR: Job failed: exit code 1
failed
gemnasium-python-dependency_scanning Scan
Running after_script
Running after script...
$ tar -cC ~/.m2 repository | tar -xC $CI_PROJECT_DIR/.m2
Uploading artifacts for failed job
Uploading artifacts...
WARNING: gl-dependency-scanning-report.json: no matching files
ERROR: No files to upload
Cleaning up file based variables
ERROR: Job failed: exit code 1