Change ci-cd branch

20 jobs for trusted-GONRG-2850_Migrate_and_Refactor_Wellbore_service_to_the_common_gke_pipeline in 47 minutes and 50 seconds (queued for 4 seconds)
Status Name Job ID Coverage
  Review
passed trusted-merge-branch-verification #517644
osdu-small

00:01:08

 
  Build
passed compile-and-unit-test #517645
osdu-medium

00:04:35

89.0%
 
  Containerize
passed aws-containerize #517647
osdu-medium

00:03:21

passed azure_containerize #517646
osdu-medium

00:02:52

passed osdu-gcp-containerize #517648
osdu-medium

00:02:17

 
  Scan
passed bandit-sast #517651
osdu-medium

00:01:15

failed eslint-sast #517652
osdu-medium allowed to fail

00:01:55

passed fossa-analyze #517649
osdu-medium

00:02:14

failed gemnasium-python-dependency_scanning #517650
osdu-medium allowed to fail

00:01:13

passed license_scanning #517654
osdu-medium

00:02:24

passed semgrep-sast #517653
osdu-medium

00:01:13

 
  Deploy
passed aws-update-ecs #517658
osdu-medium

00:00:50

passed azure_deploy #517657
osdu-medium

00:01:51

passed ibm-deploy #517656
osdu-medium

00:37:36

passed osdu-gcp-deploy #517655

00:00:57

 
  Integration
passed aws-test-python #517661
osdu-medium

00:02:20

passed azure_test_py #517660

00:05:52

failed ibm-test #517659
allowed to fail

00:04:27

passed osdu-gcp-test-python #517662

00:02:02

 
  Attribution
passed fossa-check-notice #517663
osdu-small

00:00:43

 
Name Stage Failure
failed
ibm-test Integration
FAILED functional/tests/test_chunking.py::test_multiple_update_sessions_in_parallel_then_commit[serializer1-well_log]
FAILED functional/tests/test_chunking.py::test_multiple_update_sessions_in_parallel_then_commit[serializer1-wellbore_trajectory]
FAILED functional/tests/test_chunking.py::test_multiple_update_sessions_in_parallel_then_commit[serializer1-log]
FAILED functional/tests/test_chunking.py::test_get_data_from_record_data_without_dask[serializer0-log]
FAILED functional/tests/test_chunking.py::test_data_without_dask_update_session[serializer0-log]
FAILED functional/tests/test_session.py::test_create_get_session - requests.e...
FAILED functional/tests/test_session.py::test_list_session - requests.excepti...
============ 35 failed, 124 passed, 34 skipped in 157.57s (0:02:37) ============
ERROR: Job failed: exit code 1
failed
eslint-sast Scan
Running after script...
$ tar -cC ~/.m2 repository | tar -xC $CI_PROJECT_DIR/.m2
tar: can't remove old file repository/sslext/sslext/1.2-0/sslext-1.2-0.pom.sha1: Permission denied
Uploading artifacts for failed job
Uploading artifacts...
WARNING: gl-sast-report.json: no matching files
ERROR: No files to upload
Cleaning up file based variables
ERROR: Job failed: exit code 1
failed
gemnasium-python-dependency_scanning Scan
Running after_script
Running after script...
$ tar -cC ~/.m2 repository | tar -xC $CI_PROJECT_DIR/.m2
Uploading artifacts for failed job
Uploading artifacts...
WARNING: gl-dependency-scanning-report.json: no matching files
ERROR: No files to upload
Cleaning up file based variables
ERROR: Job failed: exit code 1