Creating Release Commit

16 jobs for v0.10.0 in 18 minutes and 2 seconds (queued for 11 seconds)
latest
Status Name Job ID Coverage
  Build
passed compile-and-unit-test #465990
osdu-medium

00:04:43

88.0%
 
  Containerize
passed aws-containerize #465992
osdu-medium

00:02:37

passed azure_containerize #465991
osdu-medium

00:02:19

passed containerize #465993
osdu-medium

00:01:49

passed osdu-gcp-containerize #465994
osdu-medium

00:01:36

 
  Scan
passed fossa-analyze #465995
osdu-medium

00:01:49

 
  Deploy
passed aws-update-ecs #465999
osdu-medium

00:00:47

passed azure_deploy #465998
osdu-medium

00:01:58

passed ibm-deploy #465997
osdu-medium

00:04:28

passed osdu-gcp-deploy #465996

00:00:22

 
  Integration
passed aws-test-python #466002
osdu-medium

00:01:48

passed azure_test_py #466001

00:02:21

failed ibm-test #466000
allowed to fail

00:07:54

failed osdu-gcp-test-python #466003
allowed to fail

00:02:59

 
  Attribution
failed fossa-check-notice #466100
osdu-small

00:00:46

failed fossa-check-notice #466004
osdu-small

00:00:47

 
Name Stage Failure
failed
fossa-check-notice Attribution
You can download the NOTICE file from this job's artifacts and directly commit it to the repository to resolve
this. Before doing so, review the differences to make sure that they make sense given the changes that you have
made. If they do not, reach out to a maintainer to help diagnose the issue.
Uploading artifacts for failed job
Uploading artifacts...
public: found 2 matching files and directories

Uploading artifacts as "archive" to coordinator... ok
id=466100 responseStatus=201 Created token=u5becNuf
Cleaning up file based variables
ERROR: Job failed: exit code 1
failed
ibm-test Integration
FAILED functional/tests/test_chunking.py::test_multiple_update_sessions_in_parallel_then_commit[serializer0-log]
FAILED functional/tests/test_chunking.py::test_multiple_update_sessions_in_parallel_then_commit[serializer1-well_log]
FAILED functional/tests/test_chunking.py::test_multiple_update_sessions_in_parallel_then_commit[serializer1-wellbore_trajectory]
FAILED functional/tests/test_chunking.py::test_multiple_update_sessions_in_parallel_then_commit[serializer1-log]
FAILED functional/tests/test_chunking.py::test_get_data_from_record_data_without_dask[serializer0-log]
FAILED functional/tests/test_session.py::test_create_get_session - requests.e...
FAILED functional/tests/test_session.py::test_list_session - requests.excepti...
============ 34 failed, 124 passed, 33 skipped in 362.79s (0:06:02) ============
ERROR: Job failed: exit code 1
failed
osdu-gcp-test-python Integration
=========================== short test summary info ============================
FAILED functional/tests/test_crud.py::test_crud_create_record[data_partition-well]
FAILED functional/tests/test_crud.py::test_crud_get_record[data_partition-well]
FAILED functional/tests/test_crud.py::test_crud_record_versions[data_partition-well]
FAILED functional/tests/test_crud.py::test_crud_delete_record[data_partition-well]
FAILED functional/tests/test_crud_v3.py::test_crud_create_record[osdu_welllog]
FAILED functional/tests/test_crud_v3.py::test_crud_create_record[osdu_wellboretrajectory]
============= 6 failed, 100 passed, 85 skipped in 93.73s (0:01:33) =============
ERROR: Job failed: exit code 1