Merge branch 'notice-update' into 'master'

Update fossa notice

See merge request !180
Status Name Job ID Coverage
  Build
passed compile-and-unit-test #453487
osdu-medium

00:04:00

88.0%
 
  Containerize
passed aws-containerize #453489
osdu-medium

00:02:39

passed azure_containerize #453488
osdu-medium

00:02:28

passed containerize #453490
osdu-medium

00:01:47

passed osdu-gcp-containerize #453491
osdu-medium

00:01:58

 
  Scan
passed bandit-sast #453494
osdu-medium

00:00:47

failed eslint-sast #453495
osdu-medium allowed to fail

00:01:20

passed fossa-analyze #453492
osdu-medium

00:01:47

failed gemnasium-python-dependency_scanning #453493
osdu-medium allowed to fail

00:00:40

passed license_scanning #453497
osdu-medium

00:02:05

passed semgrep-sast #453496
osdu-medium

00:00:47

 
  Deploy
passed aws-update-ecs #453501
osdu-medium

00:00:48

passed azure_deploy #453500
osdu-medium

00:01:56

passed ibm-deploy #453499
osdu-medium

00:04:16

passed osdu-gcp-deploy #453498

00:00:18

 
  Integration
passed aws-test-python #453504
osdu-medium

00:02:16

passed azure_test_py #453503

00:02:30

failed ibm-test #453502
allowed to fail

00:08:17

failed osdu-gcp-test-python #453505
allowed to fail

00:02:27

 
  Attribution
passed fossa-check-notice #453506
osdu-small

00:00:19

 
Name Stage Failure
failed
ibm-test Integration
FAILED functional/tests/test_chunking.py::test_multiple_update_sessions_in_parallel_then_commit[serializer0-log]
FAILED functional/tests/test_chunking.py::test_multiple_update_sessions_in_parallel_then_commit[serializer1-well_log]
FAILED functional/tests/test_chunking.py::test_multiple_update_sessions_in_parallel_then_commit[serializer1-wellbore_trajectory]
FAILED functional/tests/test_chunking.py::test_multiple_update_sessions_in_parallel_then_commit[serializer1-log]
FAILED functional/tests/test_chunking.py::test_get_data_from_record_data_without_dask[serializer0-log]
FAILED functional/tests/test_session.py::test_create_get_session - requests.e...
FAILED functional/tests/test_session.py::test_list_session - requests.excepti...
============ 34 failed, 124 passed, 33 skipped in 364.47s (0:06:04) ============
ERROR: Job failed: exit code 1
failed
osdu-gcp-test-python Integration
=========================== short test summary info ============================
FAILED functional/tests/test_crud.py::test_crud_create_record[data_partition-well]
FAILED functional/tests/test_crud.py::test_crud_get_record[data_partition-well]
FAILED functional/tests/test_crud.py::test_crud_record_versions[data_partition-well]
FAILED functional/tests/test_crud.py::test_crud_delete_record[data_partition-well]
FAILED functional/tests/test_crud_v3.py::test_crud_create_record[osdu_welllog]
FAILED functional/tests/test_crud_v3.py::test_crud_create_record[osdu_wellboretrajectory]
============= 6 failed, 100 passed, 85 skipped in 66.23s (0:01:06) =============
ERROR: Job failed: exit code 1
failed
eslint-sast Scan
Running after script...
$ tar -cC ~/.m2 repository | tar -xC $CI_PROJECT_DIR/.m2
tar: can't remove old file repository/sslext/sslext/1.2-0/sslext-1.2-0.pom.sha1: Permission denied
Uploading artifacts for failed job
Uploading artifacts...
WARNING: gl-sast-report.json: no matching files
ERROR: No files to upload
Cleaning up file based variables
ERROR: Job failed: exit code 1
failed
gemnasium-python-dependency_scanning Scan
Running after_script
Running after script...
$ tar -cC ~/.m2 repository | tar -xC $CI_PROJECT_DIR/.m2
Uploading artifacts for failed job
Uploading artifacts...
WARNING: gl-dependency-scanning-report.json: no matching files
ERROR: No files to upload
Cleaning up file based variables
ERROR: Job failed: exit code 1