Update fossa notice

21 jobs for trusted-notice-update in 18 minutes and 14 seconds (queued for 4 seconds)
Status Name Job ID Coverage
  Review
passed trusted-merge-branch-verification #453346
osdu-small

00:00:21

 
  Build
passed compile-and-unit-test #453347
osdu-medium

00:05:30

88.0%
 
  Containerize
passed aws-containerize #453349
osdu-medium

00:02:30

passed azure_containerize #453348
osdu-medium

00:02:24

passed containerize #453350
osdu-medium

00:01:47

passed osdu-gcp-containerize #453351
osdu-medium

00:01:58

 
  Scan
passed bandit-sast #453354
osdu-medium

00:01:45

failed eslint-sast #453355
osdu-medium allowed to fail

00:01:29

passed fossa-analyze #453352
osdu-medium

00:01:45

failed gemnasium-python-dependency_scanning #453353
osdu-medium allowed to fail

00:00:34

passed license_scanning #453357
osdu-medium

00:03:26

passed semgrep-sast #453356
osdu-medium

00:00:53

 
  Deploy
passed aws-update-ecs #453361
osdu-medium

00:00:17

passed azure_deploy #453360
osdu-medium

00:01:44

passed ibm-deploy #453359
osdu-medium

00:04:10

passed osdu-gcp-deploy #453358

00:00:19

 
  Integration
passed aws-test-python #453364
osdu-medium

00:02:14

passed azure_test_py #453363

00:02:44

failed ibm-test #453362
allowed to fail

00:08:06

failed osdu-gcp-test-python #453365
allowed to fail

00:02:09

 
  Attribution
failed fossa-check-notice #453366
osdu-small

00:00:45

 
Name Stage Failure
failed
ibm-test Integration
FAILED functional/tests/test_crud.py::test_crud_delete_record[data_partition-wellbore]
FAILED functional/tests/test_crud.py::test_crud_delete_record[data_partition-logset]
FAILED functional/tests/test_crud.py::test_crud_delete_record[data_partition-marker]
FAILED functional/tests/test_crud.py::test_crud_delete_record[data_partition-trajectory]
FAILED functional/tests/test_crud.py::test_crud_delete_record[data_partition-log]
FAILED functional/tests/test_session.py::test_create_get_session - requests.e...
FAILED functional/tests/test_session.py::test_list_session - requests.excepti...
============ 58 failed, 100 passed, 33 skipped in 300.88s (0:05:00) ============
ERROR: Job failed: exit code 1
failed
osdu-gcp-test-python Integration
    - Via: 1.1 google
- Alt-Svc: clear
- Connection: close
body: -------------------------------------------
{"detail":[{"loc":["body",0,"data","AppliedOperations"],"msg":"extra fields not permitted","type":"value_error.extra"},{"loc":["body",0,"data","AvailableTrajectoryStationProperties"],"msg":"extra fields not permitted","type":"value_error.extra"},{"loc":["body",0,"data","CompanyID"],"msg":"extra fields not permitted","type":"value_error.extra"}]}
=========================== short test summary info ============================
FAILED functional/tests/test_crud_v3.py::test_crud_create_record[osdu_wellboretrajectory]
================== 1 failed, 108 passed, 82 skipped in 46.50s ==================
ERROR: Job failed: exit code 1
failed
fossa-check-notice Attribution
You can download the NOTICE file from this job's artifacts and directly commit it to the repository to resolve
this. Before doing so, review the differences to make sure that they make sense given the changes that you have
made. If they do not, reach out to a maintainer to help diagnose the issue.
Uploading artifacts for failed job
Uploading artifacts...
public: found 2 matching files and directories

Uploading artifacts as "archive" to coordinator... ok
id=453366 responseStatus=201 Created token=BUmsr4Fa
Cleaning up file based variables
ERROR: Job failed: exit code 1
failed
eslint-sast Scan
Running after script...
$ tar -cC ~/.m2 repository | tar -xC $CI_PROJECT_DIR/.m2
tar: can't remove old file repository/sslext/sslext/1.2-0/sslext-1.2-0.pom.sha1: Permission denied
Uploading artifacts for failed job
Uploading artifacts...
WARNING: gl-sast-report.json: no matching files
ERROR: No files to upload
Cleaning up file based variables
ERROR: Job failed: exit code 1
failed
gemnasium-python-dependency_scanning Scan
Running after_script
Running after script...
$ tar -cC ~/.m2 repository | tar -xC $CI_PROJECT_DIR/.m2
Uploading artifacts for failed job
Uploading artifacts...
WARNING: gl-dependency-scanning-report.json: no matching files
ERROR: No files to upload
Cleaning up file based variables
ERROR: Job failed: exit code 1