Merge branch 'Bulk_Data_API_Impl' into 'master'

Bulk data api impl

See merge request !169
Status Name Job ID Coverage
  Build
passed compile-and-unit-test #444410
osdu-medium

00:03:55

88.0%
 
  Containerize
passed aws-containerize #444412
osdu-medium

00:02:23

passed azure_containerize #444411
osdu-medium

00:02:15

passed containerize #444413
osdu-medium

00:01:07

passed osdu-gcp-containerize #444414
osdu-medium

00:02:49

 
  Scan
passed bandit-sast #444417
osdu-medium

00:00:37

failed eslint-sast #444418
osdu-medium allowed to fail

00:01:34

passed fossa-analyze #444415
osdu-medium

00:02:05

failed gemnasium-python-dependency_scanning #444416
osdu-medium allowed to fail

00:00:27

passed license_scanning #444420
osdu-medium

00:03:21

passed semgrep-sast #444419
osdu-medium

00:00:56

 
  Deploy
passed aws-update-ecs #444424
osdu-medium

00:00:19

failed azure_deploy #444423
osdu-medium

00:10:43

passed ibm-deploy #444422
osdu-medium

00:04:32

passed osdu-gcp-deploy #444421

00:00:19

 
  Integration
passed aws-test-python #444427
osdu-medium

00:02:22

skipped azure_test_py #444426
allowed to fail
passed ibm-test #444500

00:05:27

failed osdu-gcp-test-python #446357
allowed to fail

00:02:19

failed ibm-test #444425
allowed to fail

00:02:44

failed osdu-gcp-test-python #446227
allowed to fail

00:02:31

failed osdu-gcp-test-python #444428
allowed to fail

00:01:59

 
  Attribution
passed fossa-check-notice #444429
osdu-small

00:00:19

 
Name Stage Failure
failed
osdu-gcp-test-python Integration
FAILED functional/tests/test_dips.py::test_create_dipset_for_dips_simple[data_partition-item_value_nan]
FAILED functional/tests/test_dips.py::test_create_dipset_for_dips_simple[authority_slb-missing_items]
FAILED functional/tests/test_dips.py::test_create_dipset_for_dips_simple[authority_slb-item_value_zero]
FAILED functional/tests/test_dips.py::test_create_dipset_for_dips_simple[authority_slb-item_value_nan]
ERROR functional/tests/test_log_data.py::test_add_log_bulk_data - requests.ex...
ERROR functional/tests/test_model_validation.py::test_record_should_keep_extra_field
ERROR functional/tests/test_traj_data.py::test_add_traj_bulk_data - requests....
============= 25 failed, 7 passed, 156 skipped, 3 errors in 5.01s ==============
ERROR: Job failed: exit code 1
failed
azure_deploy Deploy
NAMESPACE: default
STATUS: deployed
REVISION: 142
TEST SUITE: None
$ kubectl rollout status deployment.v1.apps/$PROJECT_NAME -n osdu --timeout=900s
Waiting for deployment "os-wellbore-ddms" rollout to finish: 1 out of 2 new replicas have been updated...
error: deployment "os-wellbore-ddms" exceeded its progress deadline
Cleaning up file based variables
ERROR: Job failed: exit code 1
failed
eslint-sast Scan
Running after script...
$ tar -cC ~/.m2 repository | tar -xC $CI_PROJECT_DIR/.m2
tar: can't remove old file repository/sslext/sslext/1.2-0/sslext-1.2-0.pom.sha1: Permission denied
Uploading artifacts for failed job
Uploading artifacts...
WARNING: gl-sast-report.json: no matching files
ERROR: No files to upload
Cleaning up file based variables
ERROR: Job failed: exit code 1
failed
gemnasium-python-dependency_scanning Scan
Running after_script
Running after script...
$ tar -cC ~/.m2 repository | tar -xC $CI_PROJECT_DIR/.m2
Uploading artifacts for failed job
Uploading artifacts...
WARNING: gl-dependency-scanning-report.json: no matching files
ERROR: No files to upload
Cleaning up file based variables
ERROR: Job failed: exit code 1