Merge branch 'fserin/BUG_exclusiveMinimum_exclusiveMaximum_openapi' into 'master'

exclusiveMinimum and maximum does not make sense with ValueWithUnit object, it...

See merge request !174
Status Name Job ID Coverage
  Build
passed compile-and-unit-test #441969
osdu-medium

00:04:07

88.0%
 
  Containerize
passed aws-containerize #441971
osdu-medium

00:00:53

passed azure_containerize #441970
osdu-medium

00:01:05

passed containerize #441972
osdu-medium

00:01:44

passed osdu-gcp-containerize #441973
osdu-medium

00:00:26

 
  Scan
passed bandit-sast #441976
osdu-medium

00:00:46

failed eslint-sast #441977
osdu-medium allowed to fail

00:01:14

passed fossa-analyze #441974
osdu-medium

00:02:40

failed gemnasium-python-dependency_scanning #441975
osdu-medium allowed to fail

00:01:47

passed license_scanning #441979
osdu-medium

00:01:59

passed semgrep-sast #441978
osdu-medium

00:01:01

 
  Deploy
passed aws-update-ecs #441983
osdu-medium

00:00:15

passed azure_deploy #441982
osdu-medium

00:02:02

passed ibm-deploy #441981
osdu-medium

00:04:08

passed osdu-gcp-deploy #441980

00:00:35

 
  Integration
passed aws-test-python #441986
osdu-medium

00:02:35

passed azure_test_py #441985

00:02:57

failed ibm-test #441984
allowed to fail

00:03:28

failed osdu-gcp-test-python #441987
allowed to fail

00:02:29

 
  Attribution
passed fossa-check-notice #441988
osdu-small

00:00:23

 
Name Stage Failure
failed
ibm-test Integration
FAILED functional/tests/test_dips.py::test_create_dipset_for_dips_simple[data_partition-item_value_nan]
FAILED functional/tests/test_dips.py::test_create_dipset_for_dips_simple[authority_slb-missing_items]
FAILED functional/tests/test_dips.py::test_create_dipset_for_dips_simple[authority_slb-item_value_zero]
FAILED functional/tests/test_dips.py::test_create_dipset_for_dips_simple[authority_slb-item_value_nan]
ERROR functional/tests/test_log_data.py::test_add_log_bulk_data - requests.ex...
ERROR functional/tests/test_model_validation.py::test_record_should_keep_extra_field
ERROR functional/tests/test_traj_data.py::test_add_traj_bulk_data - requests....
============= 25 failed, 7 passed, 156 skipped, 3 errors in 33.57s =============
ERROR: Job failed: exit code 1
failed
osdu-gcp-test-python Integration
FAILED functional/tests/test_dips.py::test_create_dipset_for_dips_simple[data_partition-item_value_nan]
FAILED functional/tests/test_dips.py::test_create_dipset_for_dips_simple[authority_slb-missing_items]
FAILED functional/tests/test_dips.py::test_create_dipset_for_dips_simple[authority_slb-item_value_zero]
FAILED functional/tests/test_dips.py::test_create_dipset_for_dips_simple[authority_slb-item_value_nan]
ERROR functional/tests/test_log_data.py::test_add_log_bulk_data - requests.ex...
ERROR functional/tests/test_model_validation.py::test_record_should_keep_extra_field
ERROR functional/tests/test_traj_data.py::test_add_traj_bulk_data - requests....
============= 25 failed, 7 passed, 156 skipped, 3 errors in 4.72s ==============
ERROR: Job failed: exit code 1
failed
gemnasium-python-dependency_scanning Scan
Running after_script
Running after script...
$ tar -cC ~/.m2 repository | tar -xC $CI_PROJECT_DIR/.m2
Uploading artifacts for failed job
Uploading artifacts...
WARNING: gl-dependency-scanning-report.json: no matching files
ERROR: No files to upload
Cleaning up file based variables
ERROR: Job failed: exit code 1
failed
eslint-sast Scan
Running after script...
$ tar -cC ~/.m2 repository | tar -xC $CI_PROJECT_DIR/.m2
tar: can't remove old file repository/sslext/sslext/1.2-0/sslext-1.2-0.pom.sha1: Permission denied
Uploading artifacts for failed job
Uploading artifacts...
WARNING: gl-sast-report.json: no matching files
ERROR: No files to upload
Cleaning up file based variables
ERROR: Job failed: exit code 1