parameterize traces test for headers

21 jobs for trusted-avincent/request_headers_to_appinsights_customdimensions in 12 minutes and 16 seconds (queued for 5 seconds)
Status Name Job ID Coverage
  Review
passed trusted-merge-branch-verification #440367
osdu-small

00:00:51

 
  Build
passed compile-and-unit-test #440368
osdu-medium

00:04:00

88.0%
 
  Containerize
passed aws-containerize #440370
osdu-medium

00:02:46

passed azure_containerize #440369
osdu-medium

00:02:34

passed containerize #440371
osdu-medium

00:02:09

passed osdu-gcp-containerize #440372
osdu-medium

00:02:08

 
  Scan
passed bandit-sast #440375
osdu-medium

00:00:51

failed eslint-sast #440376
osdu-medium allowed to fail

00:02:02

passed fossa-analyze #440373
osdu-medium

00:01:49

failed gemnasium-python-dependency_scanning #440374
osdu-medium allowed to fail

00:01:05

passed license_scanning #440378
osdu-medium

00:02:13

passed semgrep-sast #440377
osdu-medium

00:01:07

 
  Deploy
passed aws-update-ecs #440382
osdu-medium

00:00:39

passed azure_deploy #440381
osdu-medium

00:01:49

passed ibm-deploy #440380
osdu-medium

00:04:12

passed osdu-gcp-deploy #440379

00:00:24

 
  Integration
passed aws-test-python #440385
osdu-medium

00:03:28

passed azure_test_py #440384

00:02:44

failed ibm-test #440383
allowed to fail

00:03:01

failed osdu-gcp-test-python #440386
allowed to fail

00:02:15

 
  Attribution
passed fossa-check-notice #440387
osdu-small

00:00:39

 
Name Stage Failure
failed
ibm-test Integration
FAILED functional/tests/test_dips.py::test_create_dipset_for_dips_simple[data_partition-item_value_nan]
FAILED functional/tests/test_dips.py::test_create_dipset_for_dips_simple[authority_slb-missing_items]
FAILED functional/tests/test_dips.py::test_create_dipset_for_dips_simple[authority_slb-item_value_zero]
FAILED functional/tests/test_dips.py::test_create_dipset_for_dips_simple[authority_slb-item_value_nan]
ERROR functional/tests/test_log_data.py::test_add_log_bulk_data - requests.ex...
ERROR functional/tests/test_model_validation.py::test_record_should_keep_extra_field
ERROR functional/tests/test_traj_data.py::test_add_traj_bulk_data - requests....
============= 25 failed, 7 passed, 156 skipped, 3 errors in 35.38s =============
ERROR: Job failed: exit code 1
failed
osdu-gcp-test-python Integration
FAILED functional/tests/test_dips.py::test_create_dipset_for_dips_simple[data_partition-item_value_nan]
FAILED functional/tests/test_dips.py::test_create_dipset_for_dips_simple[authority_slb-missing_items]
FAILED functional/tests/test_dips.py::test_create_dipset_for_dips_simple[authority_slb-item_value_zero]
FAILED functional/tests/test_dips.py::test_create_dipset_for_dips_simple[authority_slb-item_value_nan]
ERROR functional/tests/test_log_data.py::test_add_log_bulk_data - requests.ex...
ERROR functional/tests/test_model_validation.py::test_record_should_keep_extra_field
ERROR functional/tests/test_traj_data.py::test_add_traj_bulk_data - requests....
============= 25 failed, 7 passed, 156 skipped, 3 errors in 4.90s ==============
ERROR: Job failed: exit code 1
failed
eslint-sast Scan
Running after script...
$ tar -cC ~/.m2 repository | tar -xC $CI_PROJECT_DIR/.m2
tar: can't remove old file repository/sslext/sslext/1.2-0/sslext-1.2-0.pom.sha1: Permission denied
Uploading artifacts for failed job
Uploading artifacts...
WARNING: gl-sast-report.json: no matching files
ERROR: No files to upload
Cleaning up file based variables
ERROR: Job failed: exit code 1
failed
gemnasium-python-dependency_scanning Scan
Running after_script
Running after script...
$ tar -cC ~/.m2 repository | tar -xC $CI_PROJECT_DIR/.m2
Uploading artifacts for failed job
Uploading artifacts...
WARNING: gl-dependency-scanning-report.json: no matching files
ERROR: No files to upload
Cleaning up file based variables
ERROR: Job failed: exit code 1