Update openapi.json with update v3 alpha tag endpoints + v3 search separated

21 jobs for trusted-feature/remove-alpha-v3-APIs in 13 minutes and 38 seconds (queued for 5 seconds)
Name Stage Failure
failed
osdu-gcp-test-python Integration
FAILED functional/tests/test_dips.py::test_create_dipset_for_dips_simple[data_partition-item_value_nan]
FAILED functional/tests/test_dips.py::test_create_dipset_for_dips_simple[authority_slb-missing_items]
FAILED functional/tests/test_dips.py::test_create_dipset_for_dips_simple[authority_slb-item_value_zero]
FAILED functional/tests/test_dips.py::test_create_dipset_for_dips_simple[authority_slb-item_value_nan]
ERROR functional/tests/test_log_data.py::test_add_log_bulk_data - requests.ex...
ERROR functional/tests/test_model_validation.py::test_record_should_keep_extra_field
ERROR functional/tests/test_traj_data.py::test_add_traj_bulk_data - requests....
============= 25 failed, 7 passed, 156 skipped, 3 errors in 5.06s ==============
ERROR: Job failed: exit code 1
failed
eslint-sast Scan
Running after script...
$ tar -cC ~/.m2 repository | tar -xC $CI_PROJECT_DIR/.m2
tar: can't remove old file repository/sslext/sslext/1.2-0/sslext-1.2-0.pom.sha1: Permission denied
Uploading artifacts for failed job
Uploading artifacts...
WARNING: gl-sast-report.json: no matching files
ERROR: No files to upload
Cleaning up file based variables
ERROR: Job failed: exit code 1
failed
gemnasium-python-dependency_scanning Scan
Running after_script
Running after script...
$ tar -cC ~/.m2 repository | tar -xC $CI_PROJECT_DIR/.m2
Uploading artifacts for failed job
Uploading artifacts...
WARNING: gl-dependency-scanning-report.json: no matching files
ERROR: No files to upload
Cleaning up file based variables
ERROR: Job failed: exit code 1