Update openapi.json with update v3 alpha tag endpoints + v3 search separated

21 jobs for trusted-feature/remove-alpha-v3-APIs in 13 minutes and 38 seconds (queued for 5 seconds)
Status Name Job ID Coverage
  Review
passed trusted-merge-branch-verification #439380
osdu-small

00:00:55

 
  Build
passed compile-and-unit-test #439381
osdu-medium

00:05:23

87.0%
 
  Containerize
passed aws-containerize #439383
osdu-medium

00:02:32

passed azure_containerize #439382
osdu-medium

00:02:30

passed containerize #439384
osdu-medium

00:02:36

passed osdu-gcp-containerize #439385
osdu-medium

00:02:51

 
  Scan
passed bandit-sast #439388
osdu-medium

00:01:41

failed eslint-sast #439389
osdu-medium allowed to fail

00:01:17

passed fossa-analyze #439386
osdu-medium

00:01:25

failed gemnasium-python-dependency_scanning #439387
osdu-medium allowed to fail

00:00:42

passed license_scanning #439391
osdu-medium

00:03:11

passed semgrep-sast #439390
osdu-medium

00:00:53

 
  Deploy
passed aws-update-ecs #439395
osdu-medium

00:00:18

passed azure_deploy #439394
osdu-medium

00:02:00

passed ibm-deploy #439393
osdu-medium

00:04:13

passed osdu-gcp-deploy #439392

00:00:19

 
  Integration
passed aws-test-python #439398
osdu-medium

00:01:44

passed azure_test_py #439397

00:02:02

passed ibm-test #439396

00:02:58

failed osdu-gcp-test-python #439399
allowed to fail

00:02:02

 
  Attribution
passed fossa-check-notice #439400
osdu-small

00:00:20

 
Name Stage Failure
failed
osdu-gcp-test-python Integration
FAILED functional/tests/test_dips.py::test_create_dipset_for_dips_simple[data_partition-item_value_nan]
FAILED functional/tests/test_dips.py::test_create_dipset_for_dips_simple[authority_slb-missing_items]
FAILED functional/tests/test_dips.py::test_create_dipset_for_dips_simple[authority_slb-item_value_zero]
FAILED functional/tests/test_dips.py::test_create_dipset_for_dips_simple[authority_slb-item_value_nan]
ERROR functional/tests/test_log_data.py::test_add_log_bulk_data - requests.ex...
ERROR functional/tests/test_model_validation.py::test_record_should_keep_extra_field
ERROR functional/tests/test_traj_data.py::test_add_traj_bulk_data - requests....
============= 25 failed, 7 passed, 156 skipped, 3 errors in 5.06s ==============
ERROR: Job failed: exit code 1
failed
eslint-sast Scan
Running after script...
$ tar -cC ~/.m2 repository | tar -xC $CI_PROJECT_DIR/.m2
tar: can't remove old file repository/sslext/sslext/1.2-0/sslext-1.2-0.pom.sha1: Permission denied
Uploading artifacts for failed job
Uploading artifacts...
WARNING: gl-sast-report.json: no matching files
ERROR: No files to upload
Cleaning up file based variables
ERROR: Job failed: exit code 1
failed
gemnasium-python-dependency_scanning Scan
Running after_script
Running after script...
$ tar -cC ~/.m2 repository | tar -xC $CI_PROJECT_DIR/.m2
Uploading artifacts for failed job
Uploading artifacts...
WARNING: gl-dependency-scanning-report.json: no matching files
ERROR: No files to upload
Cleaning up file based variables
ERROR: Job failed: exit code 1