Creating Release Commit

15 jobs for v0.9.0 in 13 minutes and 14 seconds (queued for 2 seconds)
latest
Status Name Job ID Coverage
  Build
passed compile-and-unit-test #374254
osdu-medium

00:02:15

87.0%
 
  Containerize
passed aws-containerize #374256
osdu-medium

00:02:30

passed azure_containerize #374255
osdu-medium

00:02:29

passed containerize #374257
osdu-medium

00:01:51

passed osdu-gcp-containerize #374258
osdu-medium

00:02:01

 
  Scan
passed fossa-analyze #374259
osdu-medium

00:02:05

 
  Deploy
passed aws-update-ecs #374263
osdu-medium

00:00:51

passed azure_deploy #374262
osdu-medium

00:02:03

passed ibm-deploy #374261
osdu-medium

00:05:30

passed osdu-gcp-deploy #374260

00:00:28

 
  Integration
passed aws-test-python #374266
osdu-medium

00:02:11

passed azure_test_py #374265

00:03:37

failed ibm-test #374264
allowed to fail

00:05:22

passed osdu-gcp-test-python #374267

00:03:04

 
  Attribution
passed fossa-check-notice #374268
osdu-small

00:00:17

 
Name Stage Failure
failed
ibm-test Integration
    - Set-Cookie: 8bd0f11527eb76b6755999fe9ba48330=761ce58034b54248ae76cfb3ae0849a9; path=/; HttpOnly; Secure
body: -------------------------------------------
{"error":["must be real number, not NoneType"]}
=========================== short test summary info ============================
FAILED functional/tests/test_dips.py::test_create_dips_simple[data_partition-expected_dips_simple2-missing_items]
FAILED functional/tests/test_dips.py::test_create_dips_simple[authority_slb-expected_dips_simple1-item_value_nan]
FAILED functional/tests/test_dips.py::test_create_dips_simple[authority_slb-expected_dips_simple2-missing_items]
============ 3 failed, 58 passed, 115 skipped in 181.91s (0:03:01) =============
ERROR: Job failed: exit code 1