Creating Release Commit

15 jobs for v0.8.0 in 13 minutes and 52 seconds (queued for 1 second)
latest
Status Name Job ID Coverage
  Build
passed compile-and-unit-test #305294
osdu-medium

00:01:31

87.0%
 
  Containerize
passed aws-containerize #305296
osdu-medium

00:02:31

passed azure_containerize #305295
osdu-medium

00:02:39

passed containerize #305297
osdu-medium

00:01:54

passed osdu-gcp-containerize #305298
osdu-medium

00:01:42

 
  Scan
passed fossa-analyze #305299
osdu-medium

00:01:37

 
  Deploy
passed aws-update-ecs #305303
osdu-medium

00:00:50

passed azure_deploy #305302
osdu-medium

00:01:50

passed ibm-deploy #305301
osdu-medium

00:10:39

passed osdu-gcp-deploy #305300

00:00:26

 
  Integration
passed aws-test-python #305306
osdu-medium

00:01:46

passed azure_test_py #305305

00:01:34

passed ibm-test #305304

00:01:37

failed osdu-gcp-test-python #305307
allowed to fail

00:01:37

 
  Attribution
failed fossa-check-notice #305308
osdu-small

00:02:00

 
Name Stage Failure
failed
fossa-check-notice Attribution
----------------------------------------
You can download the NOTICE file from this job's artifacts and directly commit it to the repository to resolve
this. Before doing so, review the differences to make sure that they make sense given the changes that you have
made. If they do not, reach out to a maintainer to help diagnose the issue.
Uploading artifacts for failed job
Uploading artifacts...
public: found 2 matching files and directories

Uploading artifacts as "archive" to coordinator... ok
id=305308 responseStatus=201 Created token=Txwi8aZq
ERROR: Job failed: exit code 1
failed
osdu-gcp-test-python Integration
    - Connection: close
body: -------------------------------------------
{"error":["403, message='Forbidden', url=URL('https://www.googleapis.com/upload/storage/v1/b/nice-etching-277309-logstore-osdu/o?name=d1d58f0b-8240-4eea-b947-81b10a971892&uploadType=media')"]}
=========================== short test summary info ============================
FAILED functional/tests/test_dips.py::test_create_dips - requests.exceptions....
FAILED functional/tests/test_log_data.py::test_add_log_bulk_data - requests.e...
FAILED functional/tests/test_traj_data.py::test_add_traj_bulk_data - requests...
================== 3 failed, 45 passed, 44 skipped in 12.40s ===================
ERROR: Job failed: exit code 1