wb movie to common pipeline

12 jobs for trusted-GONRG-2066_release_wellbore_pipe_k8s in 11 minutes and 43 seconds
Status Name Job ID Coverage
  Review
passed trusted-merge-branch-verification #294350
osdu-small

00:00:47

 
  Build
passed compile-and-unit-test #294351
osdu-medium

00:01:28

87.0%
 
  Containerize
passed containerize #294352
osdu-medium

00:01:32

passed osdu-gcp-containerize-for-release #294353
osdu-medium

00:02:56

 
  Scan
passed bandit-sast #294356
osdu-medium

00:01:42

failed eslint-sast #294357
osdu-medium allowed to fail

00:04:31

passed fossa-analyze #294354
osdu-medium

00:01:50

failed gemnasium-python-dependency_scanning #294355
osdu-medium allowed to fail

00:01:49

passed license_scanning #294358
osdu-medium

00:03:04

 
  Deploy
passed osdu-gcp-deploy #294359

00:02:47

 
  Integration
failed osdu-gcp-test-python #294360
allowed to fail

00:02:04

 
  Attribution
passed fossa-check-notice #294361
osdu-small

00:00:19

 
Name Stage Failure
failed
osdu-gcp-test-python Integration
    - Connection: close
body: -------------------------------------------
{"error":["404, message='Not Found', url=URL('https://www.googleapis.com/upload/storage/v1/b/osdu-service-prod-logstore-osdu/o?name=a7555f98-96a9-4503-bcfd-bf1e7c6ee5ca&uploadType=media')"]}
=========================== short test summary info ============================
FAILED functional/tests/test_dips.py::test_create_dips - requests.exceptions....
FAILED functional/tests/test_log_data.py::test_add_log_bulk_data - requests.e...
FAILED functional/tests/test_traj_data.py::test_add_traj_bulk_data - requests...
================== 3 failed, 44 passed, 44 skipped in 20.16s ===================
ERROR: Job failed: exit code 1
failed
eslint-sast Scan
Running after_script
Running after script...
$ tar -cC ~/.m2 repository | tar -xC $CI_PROJECT_DIR/.m2
tar: can't remove old file repository/sslext/sslext/1.2-0/sslext-1.2-0.pom.sha1: Permission denied
Uploading artifacts for failed job
Uploading artifacts...
WARNING: gl-sast-report.json: no matching files
ERROR: No files to upload
ERROR: Job failed: exit code 1
failed
gemnasium-python-dependency_scanning Scan
exit status 1
Running after_script
Running after script...
$ tar -cC ~/.m2 repository | tar -xC $CI_PROJECT_DIR/.m2
Uploading artifacts for failed job
Uploading artifacts...
WARNING: gl-dependency-scanning-report.json: no matching files
ERROR: No files to upload
ERROR: Job failed: exit code 1