Creating Release Commit

13 jobs for v0.7.1 in 15 minutes and 49 seconds (queued for 1 second)
latest
Status Name Job ID Coverage
  Build
passed compile-and-unit-test #280655
osdu-medium

00:01:30

86.0%
 
  Containerize
passed azure_containerize #280657
osdu-medium

00:02:26

passed containerize #280658
osdu-medium

00:01:45

passed osdu-gcp-containerize #280656
osdu-medium

00:02:39

 
  Scan
passed fossa-analyze #280659
osdu-medium

00:00:41

 
  Deploy
passed azure_deploy #280662
osdu-medium

00:01:50

passed ibm-deploy #280661
osdu-medium

00:11:51

passed osdu-gcp-deploy #280660

00:01:04

 
  Integration
passed azure_test_py #280666

00:03:25

failed ibm-test #280665
allowed to fail

00:02:23

failed osdu-gcp-tagging #280664

00:00:52

passed osdu-gcp-test-python #280663

00:03:19

 
  Attribution
passed fossa-check-notice #280667
osdu-small

00:00:33

 
Name Stage Failure
failed
ibm-test Integration
FAILED functional/tests/test_crud.py::test_crud_create_record[marker] - reque...
FAILED functional/tests/test_crud.py::test_crud_create_record[trajectory] - r...
FAILED functional/tests/test_crud.py::test_crud_create_record[log] - requests...
FAILED functional/tests/test_dips.py::test_create_dipset - requests.exception...
ERROR functional/tests/test_log_data.py::test_add_log_bulk_data - requests.ex...
ERROR functional/tests/test_model_validation.py::test_record_should_keep_extra_field
ERROR functional/tests/test_traj_data.py::test_add_traj_bulk_data - requests....
============== 7 failed, 5 passed, 64 skipped, 3 errors in 21.09s ==============
ERROR: Job failed: exit code 1
failed
osdu-gcp-tagging Integration
This will tag gcr.io/nice-etching-277309/wellbore-ddms/-gcp:85bca822 
with:
gcr.io/nice-etching-277309/wellbore-ddms/-gcp:v0.7.1

Do you want to continue (Y/n)?
ERROR: Error during upload of: gcr.io/nice-etching-277309/wellbore-ddms/-gcp:v0.7.1
ERROR: (gcloud.container.images.add-tag) Not found: response: {'docker-distribution-api-version': 'registry/2.0', 'content-type': 'application/json', 'date': 'Tue, 23 Mar 2021 20:30:42 GMT', 'server': 'Docker Registry', 'cache-control': 'private', 'x-xss-protection': '0', 'x-frame-options': 'SAMEORIGIN', 'alt-svc': 'h3-29=":443"; ma=2592000,h3-T051=":443"; ma=2592000,h3-Q050=":443"; ma=2592000,h3-Q046=":443"; ma=2592000,h3-Q043=":443"; ma=2592000,quic=":443"; ma=2592000; v="46,43"', 'transfer-encoding': 'chunked', 'status': '404', 'content-length': '161', '-content-encoding': 'gzip'}
Failed to fetch "85bca822" from request "/v2/nice-etching-277309/wellbore-ddms/-gcp/manifests/85bca822".: <no details provided>
ERROR: Job failed: exit code 1