Creating Release Commit

21 jobs for v0.7.0 in 15 minutes and 49 seconds (queued for 2 seconds)
latest
Status Name Job ID Coverage
  Build
passed compile-and-unit-test #267393
osdu-medium

00:03:01

86.0%
 
  Containerize
passed azure_containerize #267395
osdu-medium

00:03:37

passed containerize #267396
osdu-medium

00:02:53

passed osdu-gcp-containerize #267394
osdu-medium

00:02:44

 
  Scan
passed fossa-analyze #267397
osdu-medium

00:01:49

 
  Deploy
passed azure_deploy #267400
osdu-medium

00:01:11

passed ibm-deploy #267399
osdu-medium

00:06:25

passed osdu-gcp-deploy #267398

00:00:18

 
  Integration
failed azure_test_py #269663
allowed to fail

00:04:27

passed ibm-test #267408

00:01:51

failed osdu-gcp-tagging #269664

00:01:17

passed osdu-gcp-test-python #267406

00:01:52

failed azure_test_py #267411
allowed to fail

00:01:37

failed azure_test_py #267409
allowed to fail

00:02:21

failed azure_test_py #267404
allowed to fail

00:01:48

failed ibm-test #267403
allowed to fail

00:02:08

failed osdu-gcp-tagging #267410

00:00:10

failed osdu-gcp-tagging #267407

00:00:12

failed osdu-gcp-tagging #267402

00:00:15

failed osdu-gcp-test-python #267401
allowed to fail

00:03:06

 
  Attribution
passed fossa-check-notice #267405
osdu-small

00:01:55

 
Name Stage Failure
failed
azure_test_py Integration
FAILED functional/tests/test_crud.py::test_crud_create_record[trajectory] - r...
FAILED functional/tests/test_crud.py::test_crud_create_record[log] - requests...
FAILED functional/tests/test_dips.py::test_create_dipset - requests.exception...
FAILED functional/tests/test_dips.py::test_dip_error_code - AssertionError: u...
ERROR functional/tests/test_log_data.py::test_add_log_bulk_data - requests.ex...
ERROR functional/tests/test_model_validation.py::test_record_should_keep_extra_field
ERROR functional/tests/test_traj_data.py::test_add_traj_bulk_data - requests....
============== 11 failed, 1 passed, 64 skipped, 3 errors in 3.03s ==============
ERROR: Job failed: exit code 1
failed
osdu-gcp-tagging Integration
This will tag gcr.io/nice-etching-277309/wellbore-ddms/-gcp:31be7718 
with:
gcr.io/nice-etching-277309/wellbore-ddms/-gcp:v0.7.0

Do you want to continue (Y/n)?
ERROR: Error during upload of: gcr.io/nice-etching-277309/wellbore-ddms/-gcp:v0.7.0
ERROR: (gcloud.container.images.add-tag) Not found: response: {'docker-distribution-api-version': 'registry/2.0', 'content-type': 'application/json', 'date': 'Wed, 17 Mar 2021 20:25:39 GMT', 'server': 'Docker Registry', 'cache-control': 'private', 'x-xss-protection': '0', 'x-frame-options': 'SAMEORIGIN', 'alt-svc': 'h3-29=":443"; ma=2592000,h3-T051=":443"; ma=2592000,h3-Q050=":443"; ma=2592000,h3-Q046=":443"; ma=2592000,h3-Q043=":443"; ma=2592000,quic=":443"; ma=2592000; v="46,43"', 'transfer-encoding': 'chunked', 'status': '404', 'content-length': '161', '-content-encoding': 'gzip'}
Failed to fetch "31be7718" from request "/v2/nice-etching-277309/wellbore-ddms/-gcp/manifests/31be7718".: <no details provided>
ERROR: Job failed: exit code 1