Cleanup

3 jobs for trusted-slb/ss/blocknum in 48 seconds (queued for 1 second)
Name Stage Failure
failed
compile-and-unit-test Build
collect2: error: ld returned 1 exit status
make[2]: *** [test/seismic-store-lib/CMakeFiles/azure_storage.dir/build.make:338: bin/seismic-store-lib/azure_storage] Error 1
make[1]: *** [CMakeFiles/Makefile2:1746: test/seismic-store-lib/CMakeFiles/azure_storage.dir/all] Error 2
[ 58%] Linking CXX shared library libsdapi.so
[ 59%] Linking CXX static library libsdapi_static.a
[ 59%] Built target sdapi_static
[ 59%] Built target sdapi
make: *** [Makefile:160: all] Error 2
ERROR: Job failed: exit code 1